{"text_format":"1","workbook":"xlsx","n_sheets":11,"sheets":["APT Adjusted Factors","APT Proforma","School Formula Budget 2023-24","Special Schools & PRU","Summary for Prints","ERS 2023-24","Special Schools 2023-24","De-del","2023-24 Nursery Budget","School & Nursery Setting Lookup","Special Schools List"],"not_rendered":{"charts":0,"images":4,"macros":0,"external_links":14,"defined_names":677,"comments":2,"pivot_tables":0},"unopened":[],"bounds":{"document_bytes":16777216,"sheet_cells":100000,"rows_first":2000,"rows_last":500,"rows_between":2000,"halvings":0,"cell_chars":16384,"cell_head_chars":4096},"cells_cut":0,"cells_raw":0,"read":"whole","date_system":"1900"}

{"sheet":"APT Adjusted Factors","index":0,"n_rows":663,"n_cols":68,"rows_kept":663,"cut":false,"hidden":true,"merged":[[7,4,7,8]]}
[]
[]
[]
[]
[]
[null,null,null,null,1,2,3,4,5,6,7,8,9,10,11,12,13,14,15,16,17,18,19,20,21,22,23,24,25,26,27,28,29,30,31,32,33,34,35,36,37,38,39,40,41,42,43,44,45,46,47,48,49,50,51,52,53,54,55,56,57,58,59,60,61,62,63,64]
["Schools Block Data match #","I & A match #","Pri_FSM6_updated","Sec_FSM6_updated","LA Short","LAESTAB","School Name","Phase","Academy Type","London Fringe","Number of Primary year groups for middle schools","Number of Secondary year groups for middle schools","Number of Primary year groups for all schools","Number of Secondary year groups for all schools","Number of KS3 year groups for all schools","Number of KS4 year groups for all schools","NOR","NOR Primary","NOR Reception","NOR Y1-6 for calculation of the eligible pupils for the primary prior attainment factor ONLY","NOR Secondary","NOR KS3","NOR KS4","NOR Y7 for calculation of the eligible pupils for the secondary prior attainment factor ONLY","NOR Y8 for calculation of the eligible pupils for the secondary prior attainment factor ONLY","NOR Y9 for calculation of the eligible pupils for the secondary prior attainment factor ONLY","NOR Y10 for calculation of the eligible pupils for the secondary prior attainment factor ONLY","NOR Y11 for calculation of the eligible pupils for the secondary prior attainment factor ONLY","Reception Difference","23-24 Base NOR","Average Year Group Size","Primary FSM Units","Primary FSM6 Units","Secondary FSM Units","Secondary FSM6 Units","IDACI Primary Units Band G","IDACI Primary Units Band F","IDACI Primary Units Band E","IDACI Primary Units Band D","IDACI Primary Units Band C","IDACI Primary Units Band B","IDACI Primary Units Band A","IDACI Secondary Units Band G","IDACI Secondary Units Band F","IDACI Secondary Units Band E","IDACI Secondary Units Band D","IDACI Secondary Units Band C","IDACI Secondary Units Band B","IDACI Secondary Units Band A","EAL 3 Primary Units","EAL 3 Secondary Units","Low Prior Attainment under new EYFSP Proportion","Low prior attainment total Primary Units","Low Prior Attainment Secondary Units - Y7","Low Prior Attainment Secondary Units - Y8","Low Prior Attainment Secondary Units - Y9","Low Prior Attainment Secondary Units - Y10","Low Prior Attainment Secondary Units - Y11","Low prior attainment total Secondary Units","Mobility Primary Units","Mobility Secondary Units","Primary sparsity av. Distance to 2nd school (miles)","Secondary sparsity av. Distance to 2nd school (miles)","Sparsity NOR taper","Sparsity distance taper","Sparsity flag","Proportion of total NOR in Primary phase","Proportion of total NOR in Secondary phase"]
[null,null,null,null,"All",null,null,null,null,null,null,null,null,null,null,null,{"$f":"SUM(Q9:Q98)","v":40446.583333333343},{"$f":"SUM(R9:R98)","v":23274.416666666664},3092.8333333333335,20181.583333333336,17172.166666666668,10593.166666666668,6579,3614.166666666667,3524,3455,3356,3223,{"$f":"SUM(AC9:AC97)","v":0},{"$f":"SUM(AD9:AD98)","v":40446.583333333343},null,{"$f":"SUM(AF9:AF98)","v":7877.7316800697845},8188.1886618373701,4822.9927543472213,5834.6231393582793,9686.0691690287949,2738.891199939892,2983.5752677459227,2002.1276769074991,2366.9982530116517,2068.7738992352802,1427.9812007976277,7597.8144235487753,1950.5288061461829,2034.7135236068113,1389.3176311182388,1644.3713551494491,1482.623376195482,1072.7975509017292,4368.4407437378695,557.2639617395597,6220.5201497984499,7185.2502426254941,1663.5822978455765,1338.4330548585585,1313.1636268686075,1271.5323523212921,1247.8194637473723,4231.0581245242174,348.71924257133941,133.35717789511295]
{"$rows_left_out":656}
{"sheet":"APT Proforma","index":1,"n_rows":102,"n_cols":15,"rows_kept":102,"cut":false,"hidden":true,"merged":[[9,3,9,5],[10,3,10,5],[12,4,12,5],[12,6,12,7],[12,8,12,9],[12,11,12,12],[13,4,13,5],[13,6,13,7],[13,8,13,9],[13,11,13,12],[16,2,20,2],[16,5,16,6],[16,7,16,8],[16,9,16,12],[17,4,17,5],[17,6,17,7],[17,11,17,12],[18,4,18,5],[18,6,18,7],[18,9,20,9],[18,11,18,12],[19,4,19,5],[19,6,19,7],[19,11,19,12],[20,4,20,5],[20,6,20,7],[20,11,20,12],[22,2,29,2],[22,9,29,9],[22,10,29,10],[31,9,33,9],[31,2,32,2],[31,10,32,10],[36,11,40,11],[36,12,40,12],[46,2,46,4],[46,11,46,12],[47,2,47,4],[48,2,48,4],[35,2,40,2],[35,9,40,9],[35,10,40,10],[36,5,40,5],[36,7,40,7],[36,8,40,8],[52,4,52,5],[52,7,52,8],[52,11,52,12],[53,4,53,5],[53,7,53,8],[53,11,53,12],[49,2,49,12],[50,4,50,5],[50,7,50,8],[50,11,50,12],[51,4,51,5],[51,7,51,8],[51,11,51,12],[57,2,57,8],[57,11,57,12],[58,2,58,8],[59,2,59,8],[59,11,59,12],[60,2,60,8],[54,2,54,8],[54,11,54,12],[55,2,55,8],[55,11,55,12],[56,2,56,8],[56,11,56,12],[64,2,64,8],[64,11,64,12],[65,2,65,8],[65,11,65,12],[66,2,66,8],[66,11,66,12],[61,2,61,8],[61,11,61,12],[62,2,62,8],[62,11,62,12],[63,2,63,8],[63,11,63,12],[76,2,76,6],[76,7,76,8],[76,9,76,10],[77,2,77,8],[77,9,77,10],[78,2,78,8],[78,9,78,10],[69,2,69,8],[69,11,69,12],[72,2,72,8],[72,11,72,12],[73,2,73,8],[73,11,73,12],[83,2,83,3],[83,4,83,8],[83,11,83,12],[84,2,84,8],[84,9,84,10],[84,11,84,12],[79,4,79,5],[79,6,79,7],[80,2,80,10],[81,2,81,8],[81,9,81,10],[82,11,82,12],[90,2,90,8],[90,9,90,10],[93,2,93,8],[93,9,93,10],[94,2,94,8],[94,9,94,10],[87,2,87,8],[87,9,87,10],[88,2,88,8],[88,9,88,10],[89,2,89,8],[89,9,89,10],[101,2,101,8],[101,9,101,10],[95,2,95,8],[95,9,95,10],[96,2,96,8],[96,9,96,10],[97,2,97,8],[100,2,100,8],[100,9,100,10]]}
[]
[]
[]
[]
[]
[]
[]
[null,null,"Local Authority Funding Reform Proforma"]
{"$rows_left_out":95}
{"sheet":"School Formula Budget 2023-24","index":2,"n_rows":154,"n_cols":23,"rows_kept":154,"cut":false,"hidden":false,"merged":[[106,3,106,5],[108,3,108,5],[8,1,9,3],[8,5,9,5],[48,3,48,5],[104,3,104,5],[103,3,103,5],[8,7,9,7],[5,1,5,2],[1,1,3,1],[114,8,114,9],[99,3,99,5],[114,1,114,7],[50,3,50,5],[51,2,51,5],[52,3,52,5],[94,3,94,5],[91,3,91,5],[92,3,92,5],[38,2,39,4],[42,3,42,5],[44,3,44,5],[46,3,46,5],[72,15,72,16],[101,3,101,5],[105,3,105,5],[107,3,107,5],[109,3,109,5],[75,1,75,7],[80,1,88,1],[90,3,90,5],[71,1,73,1],[93,3,93,5],[94,1,95,1],[96,4,96,5],[97,4,97,5],[98,4,98,5],[91,1,92,1],[95,3,95,5],[128,2,128,7],[145,2,145,7],[140,2,140,6],[112,3,112,5],[123,1,123,7],[123,8,123,9],[119,8,119,9],[118,1,118,9],[10,1,10,3],[11,2,11,4],[12,2,13,4],[56,3,56,5],[57,1,57,7],[64,1,64,3],[66,2,67,4],[15,1,15,2],[53,3,53,5],[16,3,19,3],[31,1,31,7],[100,3,100,5],[102,3,102,5]]}
[]
[null,"‘The documents listed below may not be accessible for users using assistive technology. If you need to access any of these documents please contact schoolfinanceteam@derby.gov.uk.’"]
[]
[]
[]
[null,"Early Years, Schools and High Needs Block Formula Budgets 2023/24"]
[]
[null,null,null,null,null,null,null,null,null,null,null,{"$f":"VLOOKUP(B11,'School & Nursery Setting Lookup'!A:F,5,FALSE)","v":0}]
{"$rows_left_out":147}
{"sheet":"Special Schools & PRU","index":3,"n_rows":42,"n_cols":12,"rows_kept":42,"cut":false,"hidden":false,"merged":[[7,1,10,1],[1,1,3,1],[41,1,41,4],[31,2,31,3],[15,1,15,4],[27,2,27,3],[35,2,35,3],[25,2,25,3],[29,2,29,3]]}
[]
[null,"‘The documents listed below may not be accessible for users using assistive technology. If you need to access any of these documents please contact schoolfinanceteam@derby.gov.uk.’"]
[]
[]
[]
[]
[null,"Special School Budgets 2023/24"]
[null,"To view the list of schools click on the ‘All Specials’ cell below. Using the dropdown menu arrow that appears to the right of the cell select your school from the dropdown list. The spreadsheet will then be populated with financial information relating to your school."]
{"$rows_left_out":35}
{"sheet":"Summary for Prints","index":4,"n_rows":279,"n_cols":89,"rows_kept":279,"cut":false,"hidden":true,"merged":[[0,3,0,14],[100,0,100,2]]}
[null,null,null,"‘The documents listed below may not be accessible for users using assistive technology. If you need to access any of these documents please contact schoolfinanceteam@derby.gov.uk.’",null,null,null,null,null,null,null,null,null,null,null,null,null,null,null,null,null,null,null,null,null,null,null,null,null,null,null,null,null,null,null,null,null,null,null,null,null,null,null,null,null,null,null,null,null,null,null,null,null,null,null,null,null,null,null,null,null,null,null,null,null,null,null,null,null,null,null,null,null,null,null,null,null,null,null,null,null,"Checks"]
[null,null,null,null,null,null,null,null,null,null,null,null,null,null,null,null,null,null,null,null,null,null,null,null,null,null,null,null,null,null,null,null,null,null,null,null,null,null,null,null,null,null,null,null,null,null,null,null,null,null,null,null,null,null,null,null,null,null,null,null,null,null,null,null,null,null,null,null,null,null,null,null,null,null,null,null,null,null,null,null,null,{"$f":"'ERS 2023-24'!R17","v":1032000},{"$f":"'ERS 2023-24'!S17","v":1220555},{"$f":"'ERS 2023-24'!T17+'ERS 2023-24'!U17","v":125383.18999999997},{"$f":"'2023-24 Nursery Budget'!AJ242-SUM(CK103:CK109)","v":17004290.721428569}]
[null,null,null,null,null,null,null,null,null,null,null,null,null,null,null,null,null,null,null,null,null,null,null,null,null,null,null,null,null,null,null,null,null,null,null,null,null,null,null,null,null,null,null,null,null,null,null,null,null,null,null,null,null,null,null,null,null,null,null,null,null,null,null,null,null,null,null,null,null,null,null,null,null,null,null,null,null,null,null,null,null,{"$f":"CD2-CD8","v":0},{"$f":"CE2-CE8","v":0},{"$f":"CF2-CF8","v":0},{"$f":"CG2-CG8","v":-8.778571430593729}]
[]
[]
[null,null,3,4,5,6,7,8,9,10,11,12,13,14,15,16,17,18,19,20,21,22,23,24,25,26,27,28,29,30,31,32,33,34,35,36,37,38,39,40,41,42,43,44,45,46,47,48,49,50,51,52,53,54,55,56,57,58,59,60,61,62,63,64,65,66,67,68,69,70,71,72,73,74,75,76,77,78,79,80,81,82,83,84,85,86,87,88,89]
["URN","LAESTAB","School Name","NOR\n(from Adjusted Factors column O)","NOR Primary\n(from Adjusted Factors column P)","NOR Secondary\n(from Adjusted Factors column S)","NOR KS3","NOR KS4","Basic Entitlement (Primary)","Basic Entitlement (KS3)","Basic Entitlement (KS4)","Free School Meals (Primary)","Free School Meals (Secondary)","Free School Meals Ever 6 (Primary)","Free School Meals Ever 6 (Secondary)","IDACI (P F)","IDACI (P E)","IDACI (P D)","IDACI (P C)","IDACI (P B)","IDACI (P A)","IDACI (S F)","IDACI (S E)","IDACI (S D)","IDACI (S C)","IDACI (S B)","IDACI (S A)","EAL (P)","EAL (S)","Low Prior Attainment (P)","Low Prior Attainment (S)","Mobility (P)","Mobility (S)","Lump Sum","Sparsity Funding","London Fringe","Split Sites","23-24 NFF NNDR allocation","Adjustment to 22-23 rates (or inflationary increases to 23-24 rates)","PFI","23-24 Approved Exceptional Circumstance 1: Reserved for Additional lump sum for schools amalgamated during FY22-23","23-24 Approved Exceptional Circumstance 2: Reserved for additional sparsity lump sum","23-24 Approved Exceptional Circumstance 3","23-24 Approved Exceptional Circumstance 4","23-24 Approved Exceptional Circumstance 5","23-24 Approved Exceptional Circumstance 6","23-24 Approved Exceptional Circumstance 7","Basic Entitlement Total","AEN Total","School Factors total","Notional SEN Budget","Total Allocation","Minimum per pupil funding: adjusted total allocation (excluding premises costs)","Minimum per pupil funding: minimum per pupil rate","Minimum per pupil funding: minimum funding level","Minimum per pupil funding: additional funding to meet the primary minimum funding level","Minimum per pupil funding: additional funding to meet the secondary minimum funding level","Total allocation including minimum funding level adjustment","Primary Funding","Secondary Funding","23-24 MFG budget using minimum funding level","Minimum allocation after capping/scaling","23-24 MFG Budget","23-24 MFG Unit Value","22-23 MFG Unit Value","MFG % change","MFG Value adjustment","23-24 MFG Adjustment","23-24 Post MFG Budget","Minimum per pupil funding: post MFG minimum funding per pupil rate","Minimum per pupil funding: per pupil rate is greater than or equal to the minimum entered on the Proforma sheet?","23-24 Post MFG per pupil Budget","Year on year % Change","De-delegation","Post De-delegation budget","Education functions for maintained schools","Post De-delegation and Education functions budget","23-24 NFF NNDR allocation","Post De-delegation and Education functions budget after deduction of 23-24 NFF NNDR allocation",null,"ERS E1 Empty Places","ERS Element 2 Pre & Post 16","ERS Element 3 Pre & Post 16","ERS Other","Schools with Nurseries, TA, ERS","Contingency","Total (excl. Rates)","Total Incl. Rates"]
["All",null,null,{"$f":"SUM(D9:D101)","v":40446.583333333343},23274.416666666664,17172.166666666668,10593.166666666668,6579,78993370.166666657,50688302.5,35480547,3781311.2064334974,2315036.522086666,5772673.0065953461,6009661.8335390277,629944.97598617512,835401.07496885816,880936.17783929955,1136159.1614455928,1055074.6886099931,956747.40453441045,653427.15005897102,905447.51800503104,861376.93129330792,1118172.5215016252,1082315.0646227021,997701.72233860812,2533695.6313679656,872118.10012241092,8298964.0302324444,7404351.717917379,329539.68422991579,181365.76193735359,11466666.666666666,{"$f":"SUM(AI9:AI101)","v":0},0,0,1419029.6414000001,66611.850000000006,1234980,0,0,0,0,0,0,0,165162219.66666666,48611421.885666579,14187288.158066671,35087757.518802308,227960929.71039987,225240308.21899983,null,null,{"$f":"SUM(BD9:BD101)","v":978109.53030129243},26715.391962151974,228965754.63266331,116857469.07425377,112108285.55840962,202883563.53306669,null,{"$f":"SUM(BK9:BK101)","v":216013446.47459668},{"$f":"SUM(BL9:BL101)","v":442163.57910265093},{"$f":"SUM(BM9:BM101)","v":421823.78586879163},null,null,{"$f":"SUM(BP9:BP101)","v":-972454.77579250792},{"$f":"SUM(BQ9:BQ101)","v":227993299.85687077},null,null,null,null,{"$f":"SUM(BV9:BV101)","v":-716904.12583333335},227276395.73103744,0,227276395.73103744,{"$f":"SUM(BZ9:BZ109)","v":1474780.1414000001},225857366.08963746,null,{"$f":"SUM(CC9:CC330)","v":0},1032000,1220555,125383.18999999999,17004299.5,0,245239603.77963749,246714383.92103744]
{"$rows_left_out":272}
{"sheet":"ERS 2023-24","index":5,"n_rows":44,"n_cols":26,"rows_kept":44,"cut":false,"hidden":true,"merged":[[4,9,4,13]]}
["ERS funding 2023/24"]
[]
[]
[]
[null,null,null,null,null,null,null,null,null,"Breakdown of placements",null,null,null,null,null,null,null,6000]
["School","Phase","DfE","Banding 2023/24","Places 22/23 AY","Local agreement","Places 23/24 AY",null,"Element 1&2 place ","DCC Pre 16","DCC Post 16","Other LA Pre 16","Other LA Post 16","Total","Vacant places","Over commissioned places",null,"Element 2 place funding","Element 3 Funding DCC only","Exceptional funding","Teacher","MFG ","PFI","Total DCC payment","Vacant top up funding "]
["Allestree Woodlands School","Secondary",5414,6000,22,4,26,null,26,20,0,4,1,25,null,-1,null,156000,120000,9994.52,null,null,null,285994.52,null,"Local agreement - to increase to 26 for full year"]
["Brackensdale Spencer Primary School ","Primary",2026,8000,45,null,40,null,42.083333333333336,38,0,1,0,39,3.0833333333333357,null,null,252500,304000,0,null,null,null,556500,24666.666666666686]
{"$rows_left_out":37}
{"sheet":"Special Schools 2023-24","index":6,"n_rows":50,"n_cols":45,"rows_kept":50,"cut":false,"hidden":true,"merged":[[3,12,3,16]]}
["Special Schools Funding 2023/24"]
[null,null,null,null,null,null,null,null,null,null,null,null,null,null,null,null,{"$f":"H20*V4","v":628210}]
[]
[null,null,null,null,null,null,null,null,null,null,null,null,"Breakdown of placements",null,null,null,null,null,null,null,10000,660]
["School","Phase","Ref","Banding 2023/24","Places 22/23 AY","Local agreement for April to August 23","Places change  request for 23/24 AY","Budget numbers","Pre 16","Post 16","AP","Element 1&2 place ","DCC Pre 16","DCC Post 16","Other LA Pre 16","Other LA Post 16","Total","Vacant places","Over commissioned places",null,"Element 1 & 2 place funding","Teachers pay and pension","Element 3 Funding DCC only (pre 16)","Element 3 Funding DCC only (post 16)","Residential places","Exceptional funding","MFG ","PFI","Total DCC payment","Vacant top up funding ",null,"Element 3 (Top Up Funding Other LA) - Academy to recoup themselves - for info on statement sheets only - not part of the budget sheet","Total School Funding",null,null,null,"DCC E1/2 places 22/23 budget","Variance on places 2022/23 budget to 2023/24","DCC E3 places 22/23 budget","Variance on places 2022/23 budget to 2023/24","2021/22 Budget incl Other LA's","Variance 2021/22 to 2022/23 budget incl Other LA's excluding pensions","2022/23 Budget Derby City only","Variance 2022/23 to 2023/24 budget Derby City only","% variance"]
["Ivy House School","All",7026,16173,86,13,99,93.583333333333343,74.583333333333343,19,null,99,71,19,6,0,96,3,null,null,935833.33333333337,61765,1148283,307287,null,42935.520000000004,null,null,2496103.8533333335,48519,null,97038,2593141.8533333335,"local agreement to pay 13 places for April to August",null,null,86,13,78,12,2204324,327052.85333333351,2141516,354587.85333333351,0.12919959069020803]
["St Andrews School - Day","Secondary",7027,10670,136,14,150,144.16666666666669,108.16666666666669,36,null,150,95,36,6,9,146,4,null,null,1441666.6666666665,95150,1013650,384120,null,73934.45,null,null,3008521.1166666667,42680,null,160050,3168571.1166666667,null,null,null,136,14,115,16,2786071,287350.1166666667,2641045,367476.1166666667,9.3495198268930158E-2]
["St Andrews Resi",null,7027,19530,12,null,12,12,12,0,null,12,12,null,null,null,12,null,null,null,120000,7920,null,null,234360,null,0,null,362280,null,"are you continue to fund this at 12 places - have you te evidene that they are actually using this - last year this had a MFG of £12150 no increase in the funding amount will this need to increase",0,362280,null,null,null,12,0,12,0,374430,-20070,374430,-12150,-5.6637317981713453E-2]
{"$rows_left_out":43}
{"sheet":"De-del","index":7,"n_rows":38,"n_cols":21,"rows_kept":38,"cut":false,"hidden":true,"merged":[[7,2,7,3],[8,2,8,3],[5,18,5,19],[5,6,5,7],[5,8,5,9],[5,10,5,11],[5,12,5,13],[5,14,5,15],[5,16,5,17]]}
[]
[]
[]
[]
[]
[null,null,null,null,null,null,"Contingencies",null,"Insurance",null,"Staff costs supply cover",null,"Support to underperforming ethnic minority groups and bilingual learners",null,"Behaviour support services",null,"Total unit value",null,"Total de delegation"]
[null,null,null,null,"Primary","Secondary","Primary","Secondary","Primary","Secondary","Primary","Secondary","Primary","Secondary","Primary","Secondary","Primary","Secondary","Primary","Secondary","Total"]
[null,null,"Primary AWPU",null,7061,null,6.44,null,14.65,null,{"$f":"19.66+5","v":24.66},null,14.5,null,{"$f":"4.36+6.82","v":11.18},null,{"$f":"SUM(G8:P8)","v":71.430000000000007},null,{"$f":"E8*Q8","v":504367.23000000004},null,{"$f":"S8","v":504367.23000000004}]
{"$rows_left_out":31}
{"sheet":"2023-24 Nursery Budget","index":8,"n_rows":257,"n_cols":43,"rows_kept":257,"cut":false,"hidden":true,"merged":[]}
[]
[]
[]
[]
[]
["Early Years Single Formula Budget",null,null,null,null,null,null,null,null,null,null,null,null,null,null,null,null,null,null,null,null,null,null,null,null,null,"2022/23 Rates",null,100000,1.5083128487908584,null,4.54,0.6,0.2,0.2]
[null,null,null,null,null,null,null,null,null,null,"DEPRIVATION IMD"]
["2023-24 Budget",null,null,null,"PUPIL LED BASE AMOUNT",null,null,null,null,null,"20% most deprived",null,null,null,null,"20% to 40% most deprived",null,null,null,null,null,null,"EAL",null,null,null,null,null,100000,2.0482503209631657,null,4.6999999999999993,0.6,0.2,0.2]
{"$rows_left_out":250}
{"sheet":"School & Nursery Setting Lookup","index":9,"n_rows":249,"n_cols":11,"rows_kept":249,"cut":false,"hidden":true,"merged":[]}
[]
[]
[]
[]
[]
["CLICK ON THE ARROW BUTTON TO SELECT YOUR SCHOOL FROM THE LIST",null,12345,null,null,null,"CLICK ON THE ARROW BUTTON TO SELECT YOUR SCHOOL FROM THE LIST",null,12345]
["All Schools",null,"All",6,6,null,"All Schools",null,"All",6,6]
["Ace Nursery","DE23 8DH",206189,"D",4,null,"Ace Nursery","DE23 8DH",206189,"D",4]
{"$rows_left_out":242}
{"sheet":"Special Schools List","index":10,"n_rows":17,"n_cols":3,"rows_kept":17,"cut":false,"hidden":true,"merged":[]}
[]
[]
[]
[]
[]
["CLICK ON THE ARROW BUTTON TO SELECT YOUR SCHOOL FROM THE LIST","CC","All"]
["All Specials",null,"All"]
["Ivy House School",null,7026]
{"$rows_left_out":9}