{"text_format":"1","workbook":"xlsx","n_sheets":18,"sheets":["APT Proforma","School Formula Budget 2021-22","Special Schools & PRU","DSG MNS Allocations","2021-22 Nursery Budget","ERS 2021-22","Special Schools 2021-22","Summary for Prints","School & Nursery Setting Lookup","Special Schools List","Pupil Numbers - Jan's report","AWPU","DE-DEL","DEP","LAC","LCHI","EAL","MOB"],"not_rendered":{"charts":0,"images":3,"macros":0,"external_links":8,"defined_names":501,"comments":4,"pivot_tables":0},"unopened":[],"bounds":{"document_bytes":16777216,"sheet_cells":100000,"rows_first":2000,"rows_last":500,"rows_between":2000,"halvings":0,"cell_chars":16384,"cell_head_chars":4096},"cells_cut":0,"cells_raw":0,"read":"whole","date_system":"1900"}

{"sheet":"APT Proforma","index":0,"n_rows":88,"n_cols":15,"rows_kept":88,"cut":false,"hidden":true,"merged":[[4,3,4,5],[5,3,5,5],[7,4,7,5],[7,6,7,7],[7,8,7,9],[11,2,15,2],[11,5,11,6],[11,7,11,8],[11,9,11,12],[12,4,12,5],[12,6,12,7],[12,11,12,12],[13,11,13,12],[14,4,14,5],[14,6,14,7],[14,11,14,12],[15,4,15,5],[15,6,15,7],[15,11,15,12],[7,11,7,12],[8,4,8,5],[8,6,8,7],[8,8,8,9],[8,11,8,12],[17,2,24,2],[17,9,24,9],[17,10,24,10],[26,4,26,5],[26,6,26,7],[26,9,29,9],[13,4,13,5],[13,6,13,7],[13,9,15,9],[41,2,41,4],[41,11,41,12],[42,2,42,4],[43,2,43,4],[44,2,44,12],[26,11,26,12],[27,2,28,2],[27,10,28,10],[31,2,36,2],[31,9,36,9],[31,10,36,10],[32,5,36,5],[32,7,36,7],[32,8,36,8],[32,11,36,11],[32,12,36,12],[47,4,47,5],[47,6,47,7],[47,8,47,9],[48,4,48,5],[48,6,48,7],[48,8,48,9],[45,4,45,5],[45,6,45,7],[45,8,45,9],[46,4,46,5],[46,6,46,7],[46,8,46,9],[52,2,52,8],[52,11,52,12],[53,2,53,8],[54,2,54,8],[54,11,54,12],[49,2,49,8],[50,2,50,8],[50,11,50,12],[51,2,51,8],[51,11,51,12],[58,2,58,8],[58,11,58,12],[59,2,59,8],[59,11,59,12],[60,2,60,8],[60,11,60,12],[55,2,55,8],[56,2,56,8],[56,11,56,12],[57,2,57,8],[57,11,57,12],[66,2,66,8],[66,11,66,12],[68,2,68,6],[68,7,68,8],[68,9,68,10],[61,2,61,8],[61,11,61,12],[63,2,63,8],[63,11,63,12],[65,2,65,8],[65,11,65,12],[72,2,72,10],[73,2,73,8],[73,9,73,10],[74,11,74,12],[75,2,75,3],[75,4,75,8],[75,11,75,12],[69,2,69,8],[69,9,69,10],[70,2,70,8],[70,9,70,10],[71,4,71,5],[71,6,71,7],[79,2,79,8],[79,9,79,10],[80,2,80,8],[80,9,80,10],[81,2,81,8],[81,9,81,10],[76,2,76,8],[76,9,76,10],[76,11,76,12],[78,2,78,8],[78,9,78,10],[86,2,86,8],[86,9,86,10],[87,2,87,8],[83,2,83,8],[83,9,83,10],[84,2,84,8],[84,9,84,10],[85,2,85,8],[85,9,85,10]]}
[]
[]
[null,null,"Local Authority Funding Reform Proforma"]
[]
[null,null,"LA Name:","Derby"]
[null,null,"LA Number:",831]
{"$rows_left_out":83}
{"sheet":"School Formula Budget 2021-22","index":1,"n_rows":145,"n_cols":23,"rows_kept":145,"cut":false,"hidden":false,"merged":[[9,1,9,2],[0,2,0,5],[3,1,3,3],[4,1,4,3],[5,2,5,4],[6,2,7,4],[43,3,43,5],[10,3,13,3],[25,1,25,7],[28,2,29,4],[32,3,32,5],[34,3,34,5],[36,3,36,5],[38,3,38,5],[40,3,40,5],[41,2,41,5],[42,3,42,5],[85,3,85,5],[46,3,46,5],[47,1,47,7],[50,1,50,3],[52,2,53,4],[57,1,59,1],[61,1,61,7],[66,1,74,1],[76,3,76,5],[79,3,79,5],[80,1,81,1],[82,4,82,5],[83,4,83,5],[84,4,84,5],[77,1,78,1],[114,2,114,4],[116,3,116,5],[119,2,119,7],[136,2,136,7],[131,2,131,6],[111,8,111,9],[107,1,107,7],[109,1,109,7],[111,1,111,7],[58,15,58,16],[109,8,109,9],[87,3,87,5],[89,3,89,5],[91,3,91,5],[93,3,93,5],[96,2,96,4],[98,3,98,5],[101,2,101,4],[103,3,103,5],[105,3,105,5],[107,8,107,9]]}
[null,null,"Early Years, Schools and High Needs Block Formula Budgets 2021/22"]
[]
[null,null,null,null,null,null,null,null,null,null,null,{"$f":"VLOOKUP(B5,'School & Nursery Setting Lookup'!A:G,5,FALSE)","v":0}]
[null,"Please select your School or Nursery Setting Name in the cell below",null,null,null,"DfE No or Ofsted ID",null,"Setting Type"]
[null,"CLICK ON THE ARROW BUTTON TO SELECT YOUR SCHOOL FROM THE LIST",null,null,null,{"$f":"VLOOKUP(B5,'School & Nursery Setting Lookup'!A:E,3,FALSE)","v":12345},null,{"$f":"VLOOKUP(B5,'School & Nursery Setting Lookup'!A:G,4,FALSE)","v":0}]
[]
{"$rows_left_out":140}
{"sheet":"Special Schools & PRU","index":2,"n_rows":33,"n_cols":4,"rows_kept":33,"cut":false,"hidden":false,"merged":[[0,0,0,3],[32,0,32,3],[22,1,22,2],[6,0,6,3],[18,1,18,2],[26,1,26,2],[16,1,16,2],[20,1,20,2]]}
["Special School Budgets 2021/22"]
["Please select your school in the cell below"]
["CLICK ON THE ARROW BUTTON TO SELECT YOUR SCHOOL FROM THE LIST"]
[null,null,"DFE"]
[null,null,{"$f":"VLOOKUP($A$3,'Special Schools List'!A:C,3,FALSE)","v":"All"}]
[]
{"$rows_left_out":28}
{"sheet":"DSG MNS Allocations","index":3,"n_rows":12,"n_cols":10,"rows_kept":12,"cut":false,"hidden":true,"merged":[[0,9,0,23],[8,9,8,23]]}
["Dedicated schools grant: 2021 to 2022 supplementary funding for maintained nursery schools",null,"2021 to 2022 Indicative / conditional supplementary funding allocation for maintained nursery schools (£s) ","April 2021 to August 2021 indicative supplementary funding allocation for maintained nursery schools (£s)","September 2021 to March 2022 conditional supplementary funding allocation for maintained nursery schools (£s)1",null,null,null,null,"Dedicated schools grant (DSG): 2021 to 2022 supplementary funding allocations for maintained nursery schools"]
["England",null,55836194,23265080.833333336,32571113.166666672,null,null,null,null,"This file gives details of the 2021 to 2022 financial year supplementary funding for maintained nursery schools calculations which form part of the early years block in the DSG allocations"]
[831,"Derby",1177222,490509.16666666669,686712.83333333337,null,null,null,null,"Please note that Isles of Scilly and City of London are not included within this file."]
[null,null,null,null,null,null,null,null,null,"For 2021 to 2022, part of the supplementary funding allocations are published as indicative, and part as conditional. The allocations for April 2021 to August 2021 are indicative and will be updated"]
[null,null,1,{"$f":"D3/C3","v":0.41666666666666669},{"$f":"E3/C3","v":0.58333333333333337},null,null,null,null,"on the same basis as the universal entitlements (more information on funding arrangements in this period will follow). That is the only adjustment that will be made to those figures. "]
[null,null,null,null,null,null,null,null,null,"However, the maintained nursery school supplementary funding allocations for September 2021 to March 2022 are conditional: they may be subject to change and local authorities should "]
{"$rows_left_out":7}
{"sheet":"2021-22 Nursery Budget","index":4,"n_rows":266,"n_cols":43,"rows_kept":266,"cut":false,"hidden":true,"merged":[]}
["Early Years Single Formula Budget"]
[null,null,null,null,null,null,null,null,null,null,"DEPRIVATION IMD"]
["2021/22 Budget estimate workings",null,null,null,"PUPIL LED BASE AMOUNT",null,null,null,null,null,"20% most deprived",null,null,null,"20% to 40% most deprived",null,null,null,null,null,"EAL",null,null,null,null,null,1.32,null,4.43,0.6,0.2,0.2]
[]
["Schools with Nursery Classes","Cost Centre","DFE Ref","Synergy Ref","Summer Term 2020 Actual\n12 weeks","Autumn Term 2020 Adj Actuals\n14 weeks","Spring Term 2020/21 Budget 12 weeks","Total Base Hours","Setting Type",null,"Summer Term 2020 Actual","Autumn Term 2020/21 Budget","Spring Term 2020/21 Budget","Total IMD top 20% Hours","Summer Term 2020 Actual","Autumn Term 2020/21 Budget","Spring Term 2020/21 Budget","Total IMD 20% to 40% Hours","Grand Total Deprivation (hours)",null,"Summer Term 2020 Actual","Autumn Term 2020/21 Budget","Spring Term 2020/21 Budget","Total EAL (hours)",null,"Standalone Lump Sum","Standalone Supplement","Business Rates (NNDR)","Base Costs","IMD 20% Most Deprived","IMD 20% to 40% Deprived","EAL","Grand Total",null,"2020/21 Budget","Increase or Decrease (-)",null,"2021/22 Base Hours","2020/21 Budget Base Hours","Increase or Decrease (-)"]
[]
{"$rows_left_out":261}
{"sheet":"ERS 2021-22","index":5,"n_rows":41,"n_cols":37,"rows_kept":41,"cut":false,"hidden":true,"merged":[]}
["ERS Budget 2021/22 (using Q3 data at 13-10-2020)",null,null,null,null,null,null,null,null,null,6000]
[null,null,null,null,null,null,null,null,null,null,"A","B",null,"C",null,null,null,"D","E","F",null,null,null,null,"G"]
["School","DfE","Phase","2020/21 places as per SLA/EFA return - Pre/post 16","Banding 2021/22",null,"Element 2 Places funded (Average for Alvaston and St Bens due to reduction in places)",null,"DCC Pre 16\nE3","Other LA Pre 16\nE3","DCC Pre 16","DCC Post 16","Vacant Places\nE3","TOTAL including VACANT places",null,"Element 1 & 2 (Place Funding)","E1 empty places","Element 3 (Top Up Funding DCC)","Exceptional Payments","Other Adj","TOTAL DCC",null,"Element 3 (Top Up Funding Other LA)","Total School Funding","Vacant top up funding\n(element 3)","comment","Check to individual sheets","Variance",null,"E2 places 2020/21 19/20 budget","E2 Variance 2021/22 to 2020/21","DCC E3 places 2020/21 budget","E3 Variance 2021/22 to 2020/21","2020/21 Budget incl Other LA's","Variance","2020/21 Budget for Derby City only","Variance"]
[null,null,null,null,null,null,null,null,null,null,null,null,null,null,null,6000,4000]
[null,null,null,null,null,null,null,null,null,null,null,null,null,null,null,0]
["Allestree Woodlands Community School",5414,"Secondary",14,6000,null,14,null,13,2,{"$f":"G6","v":14},null,1,15,null,{"$f":"G6*6000","v":84000},8000,78000,0,null,{"$f":"SUM(P6:T6)","v":170000},null,12000,{"$f":"SUM(U6:W6)","v":182000},0,null,162000,0,null,14,0,12,1,168000,14000,156000,14000]
{"$rows_left_out":36}
{"sheet":"Special Schools 2021-22","index":6,"n_rows":52,"n_cols":29,"rows_kept":52,"cut":false,"hidden":true,"merged":[]}
[]
[null,null,null,null,null,null,null,3,1,2,"NO of places",null,11,11,null,null,4,10000,5,6,7,8,null,9,10,null,11]
["School","School Type","DfE","Phase","Banding2020/21 (19/20 revised rate + 4%)","Banding 2021/2 @ 0 % inflation",null,"AP","E1&2 places - Pre 16","E1&2 places - Post 16","DCC Pre 16","DCC Post 16","Other LA Pre 16","Other LA Post 16","Total","Vacant Places (Neg - empty places. Pos - add children no place funding) ","Pay and Pension Grant","Element 1 & 2 (Place Funding)","Element 3 (Top Up Funding DCC) - Pre 16","Element 3 (Top Up Funding DCC) - Post 16","Element 3 Residential Places","Exceptional Payments","Other Adjustments including Sept NOR adjustments","MFG funding/Other Adjust","PFI","TOTAL DCC","Element 3 (Top Up Funding Other LA)","Total School Funding","Vacant top up funding\n(element 3)"]
[null,null,null,null,null,null,null,null,null,null,null,null,null,null,null,null,"£"]
[null,null,null,null,null,null,null,null,null,null,null,null,null,null,null,null,660]
["Ivy House School","PMLD",7026,"All",15393.955200000002,15394,null,null,69,17,60,17,3,0,{"$f":"SUM(K6:N6)","v":80},-6,{"$f":"SUM(H6:J6)*$Q$5","v":56760},{"$f":"(I6+J6)*$R$2","v":860000},{"$f":"K6*F6","v":923640},{"$f":"L6*F6","v":261698},null,60000,0,null,null,{"$f":"SUM(Q6:Y6)","v":2162098},{"$f":"(+M6+N6)*F6","v":46182},{"$f":"SUM(Z6:AA6)","v":2208280},-92364]
{"$rows_left_out":47}
{"sheet":"Summary for Prints","index":7,"n_rows":442,"n_cols":40,"rows_kept":442,"cut":false,"hidden":true,"merged":[]}
[]
[null,null,null,2,3,4,5,6,7,8,9,10,11,12,13,14,15,16,17,18,19,20,21,22,23,24,25,26,27,28,29]
[]
["School","DfE Number (short)","DfE Number","AWPU inc delegated Budget £","Deprivation £","LAC £","LCHI SEN £","EAL £","Mobility £","Lump Sum £","Split Site £","Rates £ (based on 20-21 budget)","PFI £","Pre MFG Total","MFG (from APT)","Minimum funding adjustment","Budget before De-Delegation","De-delegation tbc","Net School budget","KS1 Class Factor","Total","NOR","ERS E1 Empty Places","ERS Element 2 Pre 16","ERS Element 2 Post 16","ERS Element 3 Pre & Post 16","ERS Other","Schools with Nurseries excl Rates, TA, ERS","Contingency","Total","Excl. Rates",null,null,null,null,null,null,"Budget after de-del (incl. rates)","Rates","Budget after de-del (excl. rates)"]
["Akaal Primary School",2014,8312014,540279,58784.934210526277,0,49928.604651162801,51956.907894736811,1458.0000000000036,117800,0,4887,0,{"$f":"SUM(D5:M5)","v":825094.4467564259},4442.6160878706478,0,{"$f":"SUM(N5:P5)","v":829537.06284429657},0,{"$f":"SUM(Q5:R5)","v":829537.06284429657},2845.46,{"$f":"SUM(S5:T5)","v":832382.52284429653},173,{"$f":"SUMIF('ERS 2021-22'!B:B,'Summary for Prints'!B5,'ERS 2021-22'!S:S)","v":0},{"$f":"(SUMIF('ERS 2021-22'!B:B,'Summary for Prints'!B5,'ERS 2021-22'!K:K))*'ERS 2021-22'!$K$1","v":0},{"$f":"(SUMIF('ERS 2021-22'!B:B,'Summary for Prints'!B5,'ERS 2021-22'!L:L))*'ERS 2021-22'!$K$1","v":0},{"$f":"SUMIF('ERS 2021-22'!B:B,'Summary for Prints'!B5,'ERS 2021-22'!R:R)","v":0},{"$f":"SUMIF('ERS 2021-22'!B:B,'Summary for Prints'!B5,'ERS 2021-22'!S:S)+SUMIF('ERS 2021-22'!B:B,'Summary for Prints'!B5,'ERS 2021-22'!T:T)","v":0},{"$f":"IFERROR(VLOOKUP(B5,'2021-22 Nursery Budget'!C:AG,31,FALSE),0)","v":0},0,{"$f":"SUM(W5:AC5)+U5","v":832382.52284429653},{"$f":"AD5-L5","v":827495.52284429653},{"$f":"A5","v":"Akaal Primary School"},{"$f":"VLOOKUP(B5,'School & Nursery Setting Lookup'!C:C,1,FALSE)","v":2014},null,null,null,null,{"$f":"AD5","v":832382.52284429653},{"$f":"L5","v":4887},{"$f":"AL5-AM5","v":827495.52284429653}]
["Allenton Community Primary School",2012,8312012,1130526,369430.90330788813,0,148961.84713375798,36144.30769230779,0,117800,0,7579,0,{"$f":"SUM(D6:M6)","v":1810442.0581339539},0,0,{"$f":"SUM(N6:P6)","v":1810442.0581339539},0,{"$f":"SUM(Q6:R6)","v":1810442.0581339539},6660.62,{"$f":"SUM(S6:T6)","v":1817102.6781339541},362,{"$f":"SUMIF('ERS 2021-22'!B:B,'Summary for Prints'!B6,'ERS 2021-22'!S:S)","v":0},{"$f":"(SUMIF('ERS 2021-22'!B:B,'Summary for Prints'!B6,'ERS 2021-22'!K:K))*'ERS 2021-22'!$K$1","v":0},{"$f":"(SUMIF('ERS 2021-22'!B:B,'Summary for Prints'!B6,'ERS 2021-22'!L:L))*'ERS 2021-22'!$K$1","v":0},{"$f":"SUMIF('ERS 2021-22'!B:B,'Summary for Prints'!B6,'ERS 2021-22'!R:R)","v":0},{"$f":"SUMIF('ERS 2021-22'!B:B,'Summary for Prints'!B6,'ERS 2021-22'!S:S)+SUMIF('ERS 2021-22'!B:B,'Summary for Prints'!B6,'ERS 2021-22'!T:T)","v":0},{"$f":"IFERROR(VLOOKUP(B6,'2021-22 Nursery Budget'!C:AG,31,FALSE),0)","v":0},0,{"$f":"SUM(W6:AC6)+U6","v":1817102.6781339541},{"$f":"AD6-L6","v":1809523.6781339541},{"$f":"A6","v":"Allenton Community Primary School"},{"$f":"VLOOKUP(B6,'School & Nursery Setting Lookup'!C:C,1,FALSE)","v":2012},null,null,null,null,{"$f":"AD6","v":1817102.6781339541},{"$f":"L6","v":7579},{"$f":"AL6-AM6","v":1809523.6781339541}]
{"$rows_left_out":437}
{"sheet":"School & Nursery Setting Lookup","index":8,"n_rows":277,"n_cols":13,"rows_kept":277,"cut":false,"hidden":true,"merged":[]}
["CLICK ON THE ARROW BUTTON TO SELECT YOUR SCHOOL FROM THE LIST",null,12345,null,null,null,null,null,"CLICK ON THE ARROW BUTTON TO SELECT YOUR SCHOOL FROM THE LIST",null,12345]
["All Schools",null,"All",6,6,null,null,null,"All Schools",null,"All",6,6]
["Ace Nursery","DE23 8DH",206189,"D",4,null,null,null,"Ace Nursery","DE23 8DH",206189,"D",4]
["Akaal Primary School",null,2014,null,null,null,null,null,"Akaal Primary School",null,2014]
["Allenton Primary School",null,2012,null,null,null,null,null,"Allenton Primary School",null,2012]
["Allestree Woodlands School",null,5414,null,null,null,null,null,"Allestree Woodlands School",null,5414]
{"$rows_left_out":272}
{"sheet":"Special Schools List","index":9,"n_rows":18,"n_cols":3,"rows_kept":18,"cut":false,"hidden":true,"merged":[]}
["CLICK ON THE ARROW BUTTON TO SELECT YOUR SCHOOL FROM THE LIST",null,"All"]
["All Specials",null,"All"]
["Ivy House School","E400101",7026]
["St Andrew's School","E400201",7027]
["St Clare's School","E400301",7025]
["St Giles' School","E400401",7024]
{"$rows_left_out":13}
{"sheet":"Pupil Numbers - Jan's report","index":10,"n_rows":129,"n_cols":50,"rows_kept":129,"cut":false,"hidden":true,"merged":[]}
[null,null,null,null,null,null,"NOR change"]
[null,"2021-22 estimate",null,null,"national curriculum year group",null,null,null,null,null,null,null,null,null,null,null,null,null,null,null,null,null,null,"total\nR-yr6","total\nKS3","total\nKS4","total\npre 16","total\npost 16","total\nall pupils",null,null,null,null,null,null,null,null,null,null,null,null,null,null,null,null,null,null,"For the LCHI tab"]
[null,"DfE","phase","school","R","EFA adjusted R",1,2,3,4,5,6,"EFA Adjusted Yr 1-6",7,8,9,"EFA Adjusted KS3",10,11,"EFA Adjusted KS4",12,13,14,null,null,null,null,null,null,"APT value","Variance","R","Yr 1-6","KS3","KS4","Post 16","ALL Pre 16","ALL",null,"Prim","Sec","Post 16","Total","Variance",null,null,null,"Yr7","Yr 8","Y9-11"]
[2014,8312014,"P","Akaal Primary School",21,null,20,28,27,26,28,23,null,0,0,0,null,0,0,null,0,0,0,173,0,0,173,0,173,173,0,21,152,0,0,0,173,173,null,173,0,0,173,0,2014,null,null,0,0,0]
[2012,8312012,"P","Allenton Primary School",37,null,46,56,51,55,58,59,null,0,0,0,null,0,0,null,0,0,0,362,0,0,362,0,362,362,0,37,325,0,0,0,362,362,null,362,0,0,362,0,2012,null,null,0,0,0]
[5414,8315414,"S","Allestree Woodlands School",0,null,0,0,0,0,0,0,null,239,239,220,null,220,218,null,96,110,0,0,698,438,1136,206,1342,1136,-206,0,0,698,438,206,1136,1342,null,0,1136,206,1342,0,5414,null,null,239,239,658]
{"$rows_left_out":124}
{"sheet":"AWPU","index":11,"n_rows":109,"n_cols":28,"rows_kept":109,"cut":false,"hidden":true,"merged":[]}
["Amount per Primary Pupil",null,"% Change",3123,2857,null,"AWPU Adjustment figure",null,"NOR"]
["Amount per secondary pupil £",null,null,null,null,null,0,"Primary",23531.500128]
["Amount per KS3 pupil £",null,null,null,4404,4018,0,"Secondary",16094.3802]
["Amount per KS4 pupil £",null,null,null,null,4963,4561]
["Per pupil (all prim & sec pupils)"]
["School","Academy / Maintained","DfE No","Primary pupils R to Yr6","KS3 pupils","KS4 pupils","Total NOR","Higher Needs Primary pupils R to Yr6","Higher Needs KS3 pupils","Higher Needs KS4 pupils","Net Primary pupils R to Yr6","Net KS3 pupils","Net KS4 pupils","Net NOR","1) Basic Entitlement - Age Weighted Pupil Funding (AWPU) £",null,null,"2019/20 AWPU","Change",null,null,null,"APT Lookup"]
{"$rows_left_out":104}
{"sheet":"DE-DEL","index":12,"n_rows":109,"n_cols":16,"rows_kept":109,"cut":false,"hidden":true,"merged":[[4,3,4,4]]}
["Amount per primary pupil £"]
["Amount per secondary pupil £"]
["Amount per KS3 pupil £"]
["Amount per KS4 pupil £"]
["Per pupil (all prim & sec pupils)",null,null,"NOR"]
["School",null,"DfE No","Primary","Secondary","De-delegated Amount","Primary £","Secondary £",null,null,"Primary AWPU","Secondary AWPU"]
{"$rows_left_out":104}
{"sheet":"DEP","index":13,"n_rows":193,"n_cols":33,"rows_kept":193,"cut":false,"hidden":true,"merged":[[5,27,5,28],[5,29,5,30],[5,31,5,32],[5,17,5,18],[5,19,5,20],[5,21,5,22],[5,23,5,24],[5,25,5,26]]}
["Deprivation Factor","% Change","FSM Ever 6 ","FSM Current","IDACI Band F 0.2 - 0.25","IDACI Band E 0.25 - 0.3","IDACI Band D 0.3 - 0.35","IDACI Band C 0.35 - 0.4","IDACI Band B 0.4 - 0.5","IDACI Band A 0.5 -1.0"]
["Amount per primary pupil £",1,460,575,215,260,410,445,475,620,"NFF Rates"]
["Amount per secondary pupil £",null,460,840,310,415,580,630,680,865,"NFF Rates"]
[]
[]
[null,null,null,null,null,null,null,null,null,null,null,null,null,null,null,null,null,"FSM Ever 6 ",null,"FSM Current",null,"IDACI Band F 0.2 - 0.25",null,"IDACI Band E 0.25 - 0.3",null,"IDACI Band D 0.3 - 0.35",null,"IDACI Band C 0.35 - 0.4",null,"IDACI Band B 0.4 - 0.5",null,"IDACI Band A 0.5 -1.0"]
{"$rows_left_out":188}
{"sheet":"LAC","index":14,"n_rows":348,"n_cols":34,"rows_kept":348,"cut":false,"hidden":true,"merged":[]}
["Amount per primary pupil £"]
["Amount per secondary pupil £",null,null,null,0]
["Amount per KS3 pupil £"]
["Amount per KS4 pupil £"]
["Per pupil (all prim & sec pupils)",null,0]
["School","DfE Number","LAC numbers","3) Looked After Children (LAC) £"]
{"$rows_left_out":343}
{"sheet":"LCHI","index":15,"n_rows":348,"n_cols":29,"rows_kept":348,"cut":false,"hidden":true,"merged":[]}
["Amount per primary pupil £","% Change",1095]
["Amount per secondary pupil £",1,null,1660]
["Amount per KS3 pupil £"]
["Amount per KS4 pupil £"]
["Per pupil (all prim & sec pupils)"]
["School","DfE Number","Primary Low Attainment","Secondary low attainment","Low attainment £",null,"Low attainment total Primary Units","Low attainment total Secondary Units"]
{"$rows_left_out":343}
{"sheet":"EAL","index":16,"n_rows":110,"n_cols":33,"rows_kept":110,"cut":false,"hidden":true,"merged":[]}
["Amount per primary pupil £",null,"% Change",null,550,"NFF Rates"]
["Amount per secondary pupil £",null,1,null,1485,"NFF Rates"]
["Amount per KS3 pupil £"]
["Amount per KS4 pupil £"]
["Per pupil (all prim & sec pupils)"]
["School","DfE Number","Primary EAL 3 pupil numbers","Secondary EAL 3 pupil numbers","Primary English as an Additional Language £","Secondary English as an Additional Language £","5) English as an Additional Language £"]
{"$rows_left_out":105}
{"sheet":"MOB","index":17,"n_rows":111,"n_cols":32,"rows_kept":111,"cut":false,"hidden":true,"merged":[]}
["Amount per primary pupil £",null,"% Change",null,900]
["Amount per secondary pupil £",null,1,null,null,1290]
["Amount per KS3 pupil £"]
["Amount per KS4 pupil £"]
["Per pupil (all prim & sec pupils)"]
["School","DfE Number","Primary Mobility","Secondary Mobility","Primary Mobility £","Secondary Mobility £","6) Mobility £"]
{"$rows_left_out":105}